BDBM50459166 CHEMBL4206819
SMILES Fc1cccc2oc3c(Cc4ccc5OCOc5c4)[nH]c(-c4nccs4)c3c(=O)c12
InChI Key InChIKey=OJEBWOWPCAFLOP-UHFFFAOYSA-N
Data  1 IC50
PDB links: 1 PDB ID matches this monomer.
  Tab Delimited (TSV)   2D SDfile   Computed 3D by Vconf -m prep SDfile
Find this compound or compounds like it in BindingDB:
Activity Spreadsheet -- Enzyme Inhibition Constant Data from BindingDB
Found 1 hit for monomerid = 50459166
TargetcGMP-specific 3',5'-cyclic phosphodiesterase(Homo sapiens (Human))
Sun Yat-Sen University
Curated by ChEMBL
LigandPNGBDBM50459166(CHEMBL4206819)
Affinity DataIC50:  1.40nM. Assay description: Inhibition of human PDE5A1 catalytic domain (535 to 860 residues) expressed in Escherichia coli BL21 using 3H-cGMP as substrate after 15 mins by liqu...
Ligand InfoPC cidPC sidPDB