BDBM50459336 CHEMBL4215653
SMILES CCOC(=O)CNP(=O)(CC\C=C(/C)CO)Oc1ccc2ccccc2c1
InChI Key InChIKey=WBSLIKPRUCONCT-FRKPEAEDSA-N
Data  2 EC50
  Tab Delimited (TSV)   2D SDfile   Computed 3D by Vconf -m prep SDfile
Find this compound or compounds like it in BindingDB:
Activity Spreadsheet -- Enzyme Inhibition Constant Data from BindingDB
Found 2 hits for monomerid = 50459336
TargetButyrophilin subfamily 3 member A1(Homo sapiens (Human))
University Of Iowa
Curated by ChEMBL
LigandPNGBDBM50459336(CHEMBL4215653)
Affinity DataEC50:  0.530nM. Assay description: Binding affinity to BTN3A1 in human PBMC assessed as stimulation of Vgamma9 Vdelta2 T cells incubated for 3 days and measured after 11 days post comp...
Ligand InfoPC cidPC sid
In DepthDetails ArticlePubMed
TargetButyrophilin subfamily 3 member A1(Homo sapiens (Human))
University Of Iowa
Curated by ChEMBL
LigandPNGBDBM50459336(CHEMBL4215653)
Affinity DataEC50:  93nM. Assay description: Binding affinity to BTN3A1 in human Vgamma9 Vdelta2 T cells mixed with human K562 cells pretreated with compound for 4 hrs assessed as INF-gamma prod...
Ligand InfoPC cidPC sid
In DepthDetails ArticlePubMed