BDBM50459595 CHEMBL4210318
SMILES Cn1ncc2c1nc(SCc1cccc(F)c1)n(-c1cccc(Cl)c1)c2=O
InChI Key InChIKey=VBFGXTXPUNYLRH-UHFFFAOYSA-N
Data  3 IC50
  Tab Delimited (TSV)   2D SDfile   Computed 3D by Vconf -m prep SDfile
Find this compound or compounds like it in BindingDB:
Activity Spreadsheet -- Enzyme Inhibition Constant Data from BindingDB
Found 3 hits for monomerid = 50459595
TargetAldehyde dehydrogenase family 1 member A3(Homo sapiens (Human))
Indiana University School Of Medicine
Curated by ChEMBL
LigandPNGBDBM50459595(CHEMBL4210318)
Affinity DataIC50:  2.60E+3nM. Assay description: Inhibition of human recombinant ALDH1A3 assessed as reduction in of NAD(P)H formation incubated for 2 mins by spectrophotometry
Ligand InfoPC cidPC sid
In DepthDetails ArticlePubMed
TargetAldehyde dehydrogenase 1A1(Homo sapiens (Human))
Indiana University School Of Medicine
Curated by ChEMBL
LigandPNGBDBM50459595(CHEMBL4210318)
Affinity DataIC50:  4.10E+3nM. Assay description: Inhibition of human recombinant ALDH1A1 assessed as reduction in of NAD(P)H formation incubated for 2 mins by spectrophotometry
Ligand InfoPC cidPC sid
In DepthDetails ArticlePubMed
TargetRetinal dehydrogenase 2(Homo sapiens (Human))
Indiana University School Of Medicine
Curated by ChEMBL
LigandPNGBDBM50459595(CHEMBL4210318)
Affinity DataIC50:  560nM. Assay description: Inhibition of human recombinant ALDH1A2 assessed as reduction in of NAD(P)H formation incubated for 2 mins by spectrophotometry
Ligand InfoPC cidPC sid
In DepthDetails ArticlePubMed