BDBM50459747 CHEMBL4216933
SMILES CCn1cc(nc1[C@@H]1CCCN1C(=O)[C@H](CC1CCCC1)NC(=O)[C@H](CN)NC(=O)[C@@H](NC(=O)[C@@H]1CCCN1C(=O)[C@H](CC(C)C)NC(C)=O)C(C)C)-c1ccccc1
InChI Key InChIKey=WPGWVGAREBBLSP-ABSZIYDWSA-N
Data  2 KI  2 IC50
  Tab Delimited (TSV)   2D SDfile   Computed 3D by Vconf -m prep SDfile
Find this compound or compounds like it in BindingDB:
Activity Spreadsheet -- Enzyme Inhibition Constant Data from BindingDB
Found 4 hits for monomerid = 50459747
TargetProtein AF-9(Homo sapiens)
China Pharmaceutical University
Curated by ChEMBL
LigandPNGBDBM50459747(CHEMBL4216933)
Affinity DataKi:  50nM. Assay description: Displacement of N-Flu-DOT1L from MBP-tagged AF9 (unknown origin) (487 to 568 residues) expressed in Escherichia coli BL21(DE3) measured after 3 hrs b...
Ligand InfoPC cidPC sid
In DepthDetails ArticlePubMed
TargetProtein ENL(Homo sapiens)
China Pharmaceutical University
Curated by ChEMBL
LigandPNGBDBM50459747(CHEMBL4216933)
Affinity DataKi:  369nM. Assay description: Displacement of N-Flu-DOT1L from MBP-tagged ENL (unknown origin) (489 to 559 residues) expressed in Escherichia coli BL21(DE3) measured after 3 hrs b...
Ligand InfoPC cidPC sid
In DepthDetails ArticlePubMed
TargetProtein AF-9(Homo sapiens)
China Pharmaceutical University
Curated by ChEMBL
LigandPNGBDBM50459747(CHEMBL4216933)
Affinity DataIC50:  341nM. Assay description: Displacement of N-Flu-DOT1L from MBP-tagged AF9 (unknown origin) (487 to 568 residues) expressed in Escherichia coli BL21(DE3) measured after 3 hrs b...
Ligand InfoPC cidPC sid
In DepthDetails ArticlePubMed
TargetProtein ENL(Homo sapiens)
China Pharmaceutical University
Curated by ChEMBL
LigandPNGBDBM50459747(CHEMBL4216933)
Affinity DataIC50:  1.57E+3nM. Assay description: Displacement of N-Flu-DOT1L from MBP-tagged ENL (unknown origin) (489 to 559 residues) expressed in Escherichia coli BL21(DE3) measured after 3 hrs b...
Ligand InfoPC cidPC sid
In DepthDetails ArticlePubMed