BDBM50459898 CHEMBL4227907
SMILES CN(CCCNc1nc(Nc2ccc(OCCCOCCCCOCCCOCC(=O)N[C@H](C(=O)N3C[C@H](O)C[C@H]3C(=O)NCc3ccc(cc3)-c3scnc3C)C(C)(C)C)cc2)ncc1Br)C(=O)C1CCC1
InChI Key InChIKey=QMGHHBHPDDAGGO-IIWOMYBWSA-N
Data  3 IC50  2 Kd
  Tab Delimited (TSV)   2D SDfile   Computed 3D by Vconf -m prep SDfile
Find this compound or compounds like it in BindingDB:
Activity Spreadsheet -- Enzyme Inhibition Constant Data from BindingDB
Found 5 hits for monomerid = 50459898
TargetSerine/threonine-protein kinase TBK1(Homo sapiens (Human))
Arvinas
Curated by ChEMBL
LigandPNGBDBM50459898(CHEMBL4227907)
Affinity DataKd:  4.60nM. Assay description: Binding affinity to human full length wild-type TBK1 expressed in mammalian expression system
In DepthDetails ArticlePubMed
TargetSerine/threonine-protein kinase TBK1(Homo sapiens (Human))
Arvinas
Curated by ChEMBL
LigandPNGBDBM50459898(CHEMBL4227907)
Affinity DataIC50:  1.30nM. Assay description: Inhibition of TBK1 (unknown origin)
In DepthDetails ArticlePubMed
TargetInhibitor of nuclear factor kappa-B kinase subunit epsilon(Homo sapiens (Human))
Arvinas
Curated by ChEMBL
LigandPNGBDBM50459898(CHEMBL4227907)
Affinity DataIC50:  8.70nM. Assay description: Inhibition of IKKepsilon (unknown origin)
In DepthDetails ArticlePubMed
TargetInhibitor of nuclear factor kappa-B kinase subunit epsilon(Homo sapiens (Human))
Arvinas
Curated by ChEMBL
LigandPNGBDBM50459898(CHEMBL4227907)
Affinity DataKd:  70nM. Assay description: Binding affinity to human full length wild-type IKKepsilon expressed in mammalian expression system
In DepthDetails ArticlePubMed
LigandPNGBDBM50459898(CHEMBL4227907)
Affinity DataIC50:  4.90E+3nM. Assay description: Inhibition of His-tagged VHL/elongin B/elongin C (unknown origin) interaction with HIF1alpha preincubated for 10 mins followed by fluorescin labelled...
In DepthDetails ArticlePubMed