BDBM50459946 CHEMBL4224862
SMILES Cc1ncsc1-c1ccc(CNC(=O)[C@@H]2C[C@@H](O)CN2C(=O)[C@@H](NC(=O)OC(C)(C)C)C(C)(C)C)cc1
InChI Key InChIKey=PKNFPFFOAWITLF-RZUBCFFCSA-N
Data  1 Kd
  Tab Delimited (TSV)   2D SDfile   Computed 3D by Vconf -m prep SDfile
Find this compound or compounds like it in BindingDB:
Activity Spreadsheet -- Enzyme Inhibition Constant Data from BindingDB
Found 1 hit for monomerid = 50459946
TargetElongin-C(Homo sapiens (Human))
University Of Dundee
Curated by ChEMBL
LigandPNGBDBM50459946(CHEMBL4224862)
Affinity DataKd:  6.50E+3nM. Assay description: Displacement of FAM-labeled HIF-1alpha peptide from VBC (unknown origin) by fluorescence polarization assay
In DepthDetails ArticlePubMed