BDBM50459947 CHEMBL4225856
SMILES Cc1ncsc1-c1ccc(CNC(=O)[C@@H]2C[C@@H](O)CN2C(=O)[C@@H](NC(=O)CO)C(C)(C)C)cc1
InChI Key InChIKey=OFCMFZVSIVJIET-LVCYWYKZSA-N
Data  2 Kd
PDB links: 1 PDB ID matches this monomer.
  Tab Delimited (TSV)   2D SDfile   Computed 3D by Vconf -m prep SDfile
Find this compound or compounds like it in BindingDB:
Activity Spreadsheet -- Enzyme Inhibition Constant Data from BindingDB
Found 2 hits for monomerid = 50459947
TargetElongin-C(Homo sapiens (Human))
University Of Dundee
Curated by ChEMBL
LigandPNGBDBM50459947(CHEMBL4225856)
Affinity DataKd:  105nM. Assay description: Binding affinity to VHL (unknown origin)/elongin C (unknown origin)/elongin B (unknown origin) by isothermal titration calorimetry-based assay
TargetElongin-C(Homo sapiens (Human))
University Of Dundee
Curated by ChEMBL
LigandPNGBDBM50459947(CHEMBL4225856)
Affinity DataKd:  200nM. Assay description: Displacement of FAM-labeled HIF-1alpha peptide from VBC (unknown origin) by fluorescence polarization assay