BDBM50460458 CHEMBL4225732
SMILES COC(=O)Nc1ccc(cc1)-c1cc(nnc1OC)[C@H](Cc1ccccc1)NC(=O)\C=C\c1cc(Cl)ccc1-n1cnnn1
InChI Key InChIKey=QDPUONQCAZSEHJ-JFKODZOBSA-N
Data  1 KI
  Tab Delimited (TSV)   2D SDfile   Computed 3D by Vconf -m prep SDfile
Find this compound or compounds like it in BindingDB:
Activity Spreadsheet -- Enzyme Inhibition Constant Data from BindingDB
Found 1 hit for monomerid = 50460458
TargetCoagulation factor XI(Homo sapiens (Human))
Bristol-Myers Squibb
Curated by ChEMBL
LigandPNGBDBM50460458(CHEMBL4225732)
Affinity DataKi:  36nM. Assay description: Inhibition of human factor 11a using pyro-Glu-Pro-Arg-pNA as substrate measured after 10 to 120 mins by spectrophotometric method
Ligand InfoPC cidPC sid
In DepthDetails ArticlePubMed