BDBM50460460 CHEMBL4227153
SMILES COC(=O)Nc1ccc(cc1)-c1cc(cnn1)[C@H](Cc1ccccc1)NC(=O)\C=C\c1cc(Cl)ccc1-n1cnnn1
InChI Key InChIKey=ISVJRDYRAQWZRO-BULTVDLSSA-N
Data  1 KI
  Tab Delimited (TSV)   2D SDfile   Computed 3D by Vconf -m prep SDfile
Find this compound or compounds like it in BindingDB:
Activity Spreadsheet -- Enzyme Inhibition Constant Data from BindingDB
Found 1 hit for monomerid = 50460460
TargetCoagulation factor XI(Homo sapiens (Human))
Bristol-Myers Squibb
Curated by ChEMBL
LigandPNGBDBM50460460(CHEMBL4227153)
Affinity DataKi:  4.10nM. Assay description: Inhibition of human factor 11a using pyro-Glu-Pro-Arg-pNA as substrate measured after 10 to 120 mins by spectrophotometric method
Ligand InfoPC cidPC sid
In DepthDetails ArticlePubMed