BDBM50460783 CHEMBL4229135
SMILES Cc1cn2c(cnc2c(Nc2cc(Cc3ncccn3)ns2)n1)-c1cn[nH]c1
InChI Key InChIKey=FGEGZTKYIBPDPJ-UHFFFAOYSA-N
Data  2 IC50  1 EC50
  Tab Delimited (TSV)   2D SDfile   Computed 3D by Vconf -m prep SDfile
Find this compound or compounds like it in BindingDB:
Activity Spreadsheet -- Enzyme Inhibition Constant Data from BindingDB
Found 3 hits for monomerid = 50460783
TargetAurora kinase B(Homo sapiens (Human))
Merck
Curated by ChEMBL
LigandPNGBDBM50460783(CHEMBL4229135)
Affinity DataEC50:  203nM. Assay description: Inhibition of Aurora B in human HCT116 cells assessed as reduction in phosphorylation of Histone H3 at Ser10 residue incubated for 1 hr by Hoechst 33...
Ligand InfoPC cidPC sid
In DepthDetails ArticlePubMed
TargetAurora kinase A(Homo sapiens (Human))
Merck
Curated by ChEMBL
LigandPNGBDBM50460783(CHEMBL4229135)
Affinity DataIC50: <4nM. Assay description: Inhibition of Aurora A (unknown origin) using Tamra-PKAtide as substrate by fluorescence polarization assay
Ligand InfoPC cidPC sid
In DepthDetails ArticlePubMed
TargetAurora kinase B(Homo sapiens (Human))
Merck
Curated by ChEMBL
LigandPNGBDBM50460783(CHEMBL4229135)
Affinity DataIC50: <13nM. Assay description: Inhibition of Aurora B (unknown origin) using Tamra-PKAtide as substrate by fluorescence polarization assay
Ligand InfoPC cidPC sid
In DepthDetails ArticlePubMed