BDBM50461081 CHEMBL4228045::US10457637, Compound 42
SMILES CCc1ccc(cc1)N(CC(C)C)S(=O)(=O)c1ccc(OC2CCOCC2)c(c1)S(C)(=N)=O
InChI Key InChIKey=YOGVHVYCSSTWGE-UHFFFAOYSA-N
Data  2 IC50
  Tab Delimited (TSV)   2D SDfile   Computed 3D by Vconf -m prep SDfile
Find this compound or compounds like it in BindingDB:
Activity Spreadsheet -- Enzyme Inhibition Constant Data from BindingDB
Found 2 hits for monomerid = 50461081
TargetNuclear receptor ROR-gamma(Homo sapiens (Human))
Galderma Research & Development
US Patent
LigandPNGBDBM50461081(CHEMBL4228045 | US10457637, Compound 42)
Affinity DataIC50: >1.00E+3nM. Assay description: The RORγ transactivation model was developed from the line HG5LN, which is a HeLa line that stably expresses a luciferase reporter gene controll...
Ligand InfoPC cidPC sid
In DepthDetails US Patent
TargetNuclear receptor ROR-gamma(Homo sapiens (Human))
Galderma Research & Development
US Patent
LigandPNGBDBM50461081(CHEMBL4228045 | US10457637, Compound 42)
Affinity DataIC50:  1.10E+3nM. Assay description: Inverse agonist activity at RORgamma (unknown origin) expressed in human HeLa-derived HG5LN cells transfected with the GAL4 DNA-binding domain fused ...
Ligand InfoPC cidPC sid
In DepthDetails ArticlePubMed