BDBM50461228 CHEMBL4226325
SMILES CCN(CC)c1ccc2cc(C3=NN(C(C3)c3ccccc3)C(=O)c3ccccc3)c(=O)oc2c1
InChI Key InChIKey=ZHHJRYNSQIQXOC-UHFFFAOYSA-N
Data  2 IC50
  Tab Delimited (TSV)   2D SDfile   Computed 3D by Vconf -m prep SDfile
Find this compound or compounds like it in BindingDB:
Activity Spreadsheet -- Enzyme Inhibition Constant Data from BindingDB
Found 2 hits for monomerid = 50461228
TargetFalcipain-2(Plasmodium falciparum)
Delhi Institute Of Pharmaceutical Sciences And Research
Curated by ChEMBL
LigandPNGBDBM50461228(CHEMBL4226325)
Affinity DataIC50: >1.00E+5nM. Assay description: Inhibition of falcipain-2 in chloroquine resistant Plasmodium falciparum RKL9 schizont stage infected in human erythrocytes assessed as reduction in ...
Ligand InfoPC cidPC sid
In DepthDetails ArticlePubMed
TargetFalcipain 2(Plasmodium falciparum)
Delhi Institute Of Pharmaceutical Sciences And Research
Curated by ChEMBL
LigandPNGBDBM50461228(CHEMBL4226325)
Affinity DataIC50: >1.00E+5nM. Assay description: Inhibition of falcipain-2 in chloroquine sensitive Plasmodium falciparum MRC-02 schizont stage infected in human erythrocytes assessed as reduction i...
Ligand InfoPC cidPC sid
In DepthDetails ArticlePubMed