BDBM50461570 CHEMBL4224723
SMILES C[C@H](NC(C)=O)C(=S)N1C[C@H](O)C[C@H]1C(=S)NCc1ccc(cc1)-c1scnc1C
InChI Key InChIKey=NPFDMJWSPHYAKU-VHSSKADRSA-N
Data  2 Kd
PDB links: 1 PDB ID matches this monomer.
  Tab Delimited (TSV)   2D SDfile   Computed 3D by Vconf -m prep SDfile
Find this compound or compounds like it in BindingDB:
Activity Spreadsheet -- Enzyme Inhibition Constant Data from BindingDB
Found 2 hits for monomerid = 50461570
TargetElongin-C(Homo sapiens (Human))
University Of Dundee
Curated by ChEMBL
LigandPNGBDBM50461570(CHEMBL4224723)
Affinity DataKd:  2.16E+4nM. Assay description: Binding affinity to VBC complex (unknown origin) by ITC assay
Ligand InfoPC cidPC sidPDB
TargetElongin-C(Homo sapiens (Human))
University Of Dundee
Curated by ChEMBL
LigandPNGBDBM50461570(CHEMBL4224723)
Affinity DataKd: >1.30E+4nM. Assay description: Binding affinity to VBC complex (unknown origin) assessed as reduction of FAM-labelled HIF1alpha peptide binding by fluorescence polarization assay
Ligand InfoPC cidPC sidPDB