BDBM50462212 CHEMBL4239409
SMILES C[C@@H](O)[C@@H]1NC(=O)[C@H](CCC(O)=O)NC(=O)[C@H](CCC(O)=O)NC(=O)[C@H](CC(O)=O)NC(=O)[C@H](CSSC[C@H](NC(=O)[C@H](CCC(O)=O)NC(=O)CNC1=O)C(O)=O)NC(C)=O
InChI Key InChIKey=KTEQAUXKLYRSOK-JFERZGRSSA-N
Data  1 KI
  Tab Delimited (TSV)   2D SDfile   Computed 3D by Vconf -m prep SDfile
Find this compound or compounds like it in BindingDB:
Activity Spreadsheet -- Enzyme Inhibition Constant Data from BindingDB
Found 1 hit for monomerid = 50462212
TargetKelch-like ECH-associated protein 1(Homo sapiens (Human))
University Of East Anglia
Curated by ChEMBL
LigandPNGBDBM50462212(CHEMBL4239409)
Affinity DataKi:  48nM. Assay description: Displacement of F-14 from Keap1 Kelch domain (unknown origin) expressed in Escherichia coli BL21 (DE3) after 15 mins by fluorescence polarization ass...
Ligand InfoPC cidPC sid
In DepthDetails ArticlePubMed