BDBM50462577 CHEMBL4243833
SMILES COc1cc2CCN(CCCCCc3cnnn3CCNc3c4CCCCc4nc4ccccc34)[C@H](c3ccccc3)c2cc1OC
InChI Key InChIKey=ITAOAYUEHIWYBK-LDLOPFEMSA-N
Data  2 Kd
  Tab Delimited (TSV)   2D SDfile   Computed 3D by Vconf -m prep SDfile
Find this compound or compounds like it in BindingDB:
Activity Spreadsheet -- Enzyme Inhibition Constant Data from BindingDB
Found 2 hits for monomerid = 50462577
TargetAcetylcholinesterase(Mus musculus (mouse))
University Of Groningen
Curated by ChEMBL
LigandPNGBDBM50462577(CHEMBL4243833)
Affinity DataKd:  0nM. Assay description: Inhibition of mouse AChE active site after 12 hrs by LC/MS-SIM analysis
Ligand InfoPC cidPC sid
In DepthDetails ArticlePubMed
TargetAcetylcholinesterase(Electrophorus electricus (Electric eel))
University Of Groningen
Curated by ChEMBL
LigandPNGBDBM50462577(CHEMBL4243833)
Affinity DataKd:  0nM. Assay description: Binding affinity to electric eel AChE after 24 hrs by LC/MS-SIM analysis
Ligand InfoPC cidPC sid
In DepthDetails ArticlePubMed