BDBM50462986 CHEMBL4244651
SMILES CC[C@H](C)[C@H](NC(=O)[C@H](C)NC(=O)[C@H](CCCNC(N)=N)NC(=O)[C@H](CCCCN)NC(=O)[C@H](Cc1c[nH]c2ccccc12)NC(C)=O)C(=O)N[C@@H](CC(C)C)C(=O)N[C@@H](CCCNC(N)=N)C(=O)N[C@@H](C)C(=O)N[C@@H](CC(C)C)C(=O)N[C@@H](CC(C)C)C(=O)N[C@@H](CCC(N)=O)C(=O)N[C@@H](CCC(O)=O)C(N)=O
InChI Key InChIKey=BJZCPAUHLAXXMT-MBXDPUPWSA-N
Data  2 Kd
  Tab Delimited (TSV)   2D SDfile   Computed 3D by Vconf -m prep SDfile
Find this compound or compounds like it in BindingDB:
Activity Spreadsheet -- Enzyme Inhibition Constant Data from BindingDB
Found 2 hits for monomerid = 50462986
TargetEstrogen receptor(Homo sapiens (Human))
Peking University Shenzhen Graduate School
Curated by ChEMBL
LigandPNGBDBM50462986(CHEMBL4244651)
Affinity DataKd:  89nM. Assay description: Binding affinity to recombinant human ERalpha LBD (301 to 553 residues) expressed in Escherichia coli BL21(DE3) using FAM-labelled compound after 1 h...
Ligand InfoPC cidPC sid
In DepthDetails ArticlePubMed
TargetEstrogen receptor beta(Homo sapiens (Human))
Peking University Shenzhen Graduate School
Curated by ChEMBL
LigandPNGBDBM50462986(CHEMBL4244651)
Affinity DataKd:  179nM. Assay description: Binding affinity to recombinant human ERbeta LBD (259 to 498 residues) C334S/C369S/C481S triple mutant expressed in Escherichia coli BL21(DE3) using ...
Ligand InfoPC cidPC sid
In DepthDetails ArticlePubMed