BDBM50463126 CHEMBL4238599
SMILES NC(=O)c1ccc(cc1)-c1cc(nc(c1)-c1ccc(cc1)[N+]([O-])=O)-c1ccco1
InChI Key InChIKey=GTTDVYCKFQYVNN-UHFFFAOYSA-N
Data  1 IC50  1 Kd
  Tab Delimited (TSV)   2D SDfile   Computed 3D by Vconf -m prep SDfile
Find this compound or compounds like it in BindingDB:
Activity Spreadsheet -- Enzyme Inhibition Constant Data from BindingDB
Found 2 hits for monomerid = 50463126
TargetMyc proto-oncogene protein(Homo sapiens (Human))
The Scripps Research Institute
Curated by ChEMBL
LigandPNGBDBM50463126(CHEMBL4238599)
Affinity DataKd:  6.5nM. Assay description: Binding affinity to His-tagged Myc (unknown origin) expressed in Escherichia coli BL21 by Bio-FET analysis
In DepthDetails ArticlePubMed
TargetMyc proto-oncogene protein(Homo sapiens (Human))
The Scripps Research Institute
Curated by ChEMBL
LigandPNGBDBM50463126(CHEMBL4238599)
Affinity DataIC50:  1.00E+3nM. Assay description: Binding affinity to ATG-Myc (unknown origin) expressed in CEF cells assessed as inhibition of microtumor formation
In DepthDetails ArticlePubMed