BDBM50463129 CHEMBL4245253
SMILES Cn1ccnc1-c1cc(cc(n1)-c1ccc(cc1)C#N)-c1ccc(cc1)C(N)=O
InChI Key InChIKey=CTUJBTFHZRSPIJ-UHFFFAOYSA-N
Data  1 IC50
  Tab Delimited (TSV)   2D SDfile   Computed 3D by Vconf -m prep SDfile
Find this compound or compounds like it in BindingDB:
Activity Spreadsheet -- Enzyme Inhibition Constant Data from BindingDB
Found 1 hit for monomerid = 50463129
TargetMyc proto-oncogene protein(Homo sapiens (Human))
The Scripps Research Institute
Curated by ChEMBL
LigandPNGBDBM50463129(CHEMBL4245253)
Affinity DataIC50:  4.00E+4nM. Assay description: Binding affinity to ATG-Myc (unknown origin) expressed in CEF cells assessed as inhibition of microtumor formation
Ligand InfoPC cidPC sid
In DepthDetails ArticlePubMed