BDBM50463217 CHEMBL4241124
SMILES C[C@H]1CCC(=C)\C(=C/C=C\C[C@]1(C)CCC1=CCOC1=O)C(O)=O
InChI Key InChIKey=ONFWNHLCKGVKGW-PTVUHMQHSA-N
Data  1 EC50
  Tab Delimited (TSV)   2D SDfile   Computed 3D by Vconf -m prep SDfile
Find this compound or compounds like it in BindingDB:
Activity Spreadsheet -- Enzyme Inhibition Constant Data from BindingDB
Found 1 hit for monomerid = 50463217
TargetVoltage-dependent L-type calcium channel subunit alpha-1S(Rattus norvegicus)
Shandong University
Curated by ChEMBL
LigandPNGBDBM50463217(CHEMBL4241124)
Affinity DataEC50:  1.40E+4nM. Assay description: Inhibition of voltage-dependent L-type calcium channel in Wistar rat 3rd-order mesenteric artery assessed as reduction in norepinephrine-induced vess...
Ligand InfoPC cidPC sid
In DepthDetails ArticlePubMed