BDBM50463353 CHEMBL4248974
SMILES CN1CCN(c2ccccc12)S(=O)(=O)c1ccc(cc1)N1CCCC1=O
InChI Key InChIKey=HKMFKYDGIJGBER-UHFFFAOYSA-N
Data  2 EC50
  Tab Delimited (TSV)   2D SDfile   Computed 3D by Vconf -m prep SDfile
Find this compound or compounds like it in BindingDB:
Activity Spreadsheet -- Enzyme Inhibition Constant Data from BindingDB
Found 2 hits for monomerid = 50463353
TargetCellular tumor antigen p53(Homo sapiens (Human))
Human Biomolecular Research Institute
Curated by ChEMBL
LigandPNGBDBM50463353(CHEMBL4248974)
Affinity DataEC50:  2nM. Assay description: Induction of p53 transcriptional activity (unknown origin) expressed in HEK293 cells coexpressing TK-driven Rluc after 20 to 22 hrs by luciferase rep...
In DepthDetails ArticlePubMed
TargetCellular tumor antigen p53(Homo sapiens (Human))
Human Biomolecular Research Institute
Curated by ChEMBL
LigandPNGBDBM50463353(CHEMBL4248974)
Affinity DataEC50:  18nM. Assay description: Activation of p53 in human MCF7 cell lysates assessed as increase in total p53 protein level by Western blot analysis
In DepthDetails ArticlePubMed