BDBM50463388 CHEMBL4240984
SMILES CC(=O)C1=C(O)C=C2Oc3c4C(=O)\C(Oc4c(C)c(O)c3[C@@]2(C)C1=O)=C\c1cc(Br)cs1
InChI Key InChIKey=YKCSRSLJKLKCPJ-ZZHBFDCBSA-N
Data  1 IC50
  Tab Delimited (TSV)   2D SDfile   Computed 3D by Vconf -m prep SDfile
Find this compound or compounds like it in BindingDB:
Activity Spreadsheet -- Enzyme Inhibition Constant Data from BindingDB
Found 1 hit for monomerid = 50463388
TargetTyrosyl-DNA phosphodiesterase 1(Homo sapiens (Human))
Siberian Branch Of The Russian Academy Of Sciences
Curated by ChEMBL
LigandPNGBDBM50463388(CHEMBL4240984)
Affinity DataIC50:  600nM. Assay description: Inhibition of recombinant Tdp1 (unknown origin) using 5'-(5,6 FAM-aac gtc agg gtc ttc c-BHQ1)-3' as substrate measured every 55 secs for 8 mins by fl...
Ligand InfoPC cidPC sid
In DepthDetails ArticlePubMed