BDBM50463615 CHEMBL4251179
SMILES CCOC(=O)c1sc(N\N=C2\C(N)=NN(C2=O)c2ccccc2)c(C(=O)OCC)c1C
InChI Key InChIKey=QATCFYALLKUORE-HMAPJEAMSA-N
Data  4 IC50
  Tab Delimited (TSV)   2D SDfile   Computed 3D by Vconf -m prep SDfile
Find this compound or compounds like it in BindingDB:
Activity Spreadsheet -- Enzyme Inhibition Constant Data from BindingDB
Found 4 hits for monomerid = 50463615
TargetLysyl oxidase homolog 3(Homo sapiens (Human))
Hungarian Academy Of Sciences
Curated by ChEMBL
LigandPNGBDBM50463615(CHEMBL4251179)
Affinity DataIC50: >1.00E+5nM. Assay description: Inhibition of recombinant human LOXL3 expressed in CHO cells using diaminopentane as substrate preincubated for 30 mins followed by substrate additio...
In DepthDetails ArticlePubMed
TargetLysyl oxidase homolog 4(Homo sapiens)
Hungarian Academy Of Sciences
Curated by ChEMBL
LigandPNGBDBM50463615(CHEMBL4251179)
Affinity DataIC50:  3.30E+3nM. Assay description: Inhibition of recombinant human LOXL4 expressed in baculovirus infected insect cells using diaminopentane as substrate preincubated for 30 mins follo...
In DepthDetails ArticlePubMed
TargetLysyl oxidase homolog 2(Homo sapiens (Human))
Hungarian Academy Of Sciences
Curated by ChEMBL
LigandPNGBDBM50463615(CHEMBL4251179)
Affinity DataIC50: >1.00E+5nM. Assay description: Inhibition of recombinant LOXL2 (unknown origin) expressed in NS0 cells using diaminopentane as substrate preincubated for 30 mins followed by substr...
In DepthDetails ArticlePubMed
TargetProtein-lysine 6-oxidase(Homo sapiens (Human))
Hungarian Academy Of Sciences
Curated by ChEMBL
LigandPNGBDBM50463615(CHEMBL4251179)
Affinity DataIC50:  5.00E+3nM. Assay description: Inhibition of recombinant human LOX expressed in HEK293 cells using diaminopentane as substrate preincubated for 30 mins followed by substrate additi...
In DepthDetails ArticlePubMed