BDBM50463852 CHEMBL4246078
SMILES FC(F)(F)c1cccnc1[C@@H](NC(=O)c1ccc2cccnc2c1)c1ccccc1
InChI Key InChIKey=SJTMLURACBBWQI-FQEVSTJZSA-N
Data  2 IC50
  Tab Delimited (TSV)   2D SDfile   Computed 3D by Vconf -m prep SDfile
Find this compound or compounds like it in BindingDB:
Activity Spreadsheet -- Enzyme Inhibition Constant Data from BindingDB
Found 2 hits for monomerid = 50463852
LigandPNGBDBM50463852(CHEMBL4246078)
Affinity DataIC50:  389nM. Assay description: Antagonist activity at human TRPM8 expressed in CHO cells assessed as inhibition of icilin-induced intracellular calcium levels preincubated for 2.5 ...
Ligand InfoPC cidPC sid
In DepthDetails ArticlePubMed
LigandPNGBDBM50463852(CHEMBL4246078)
Affinity DataIC50:  1.26E+3nM. Assay description: Antagonist activity at mouse TRPM8 expressed in CHO cells assessed as inhibition of icilin-induced intracellular calcium levels preincubated for 2.5 ...
Ligand InfoPC cidPC sid
In DepthDetails ArticlePubMed