BDBM50464123 CHEMBL4242263
SMILES Cc1cc(C)n(n1)-c1cc(cc(c1)N1CCOCC1)[C@@H](CN1CC[C@@H](CCc2ccc3CCCNc3n2)C1)CC(O)=O
InChI Key InChIKey=QESJLCKQPIPWOH-LEAFIULHSA-N
Data  1 KI  7 IC50
  Tab Delimited (TSV)   2D SDfile   Computed 3D by Vconf -m prep SDfile
Find this compound or compounds like it in BindingDB:
Activity Spreadsheet -- Enzyme Inhibition Constant Data from BindingDB
Found 8 hits for monomerid = 50464123
TargetIntegrin alpha-V/beta-6(Homo sapiens (Human))
University Of Strathclyde
Curated by ChEMBL
LigandPNGBDBM50464123(CHEMBL4242263)
Affinity DataKi:  0.0316nM. Assay description: Binding affinity to alphaVbeta6 (unknown origin) by radioligand binding assay
Ligand InfoPC cidPC sid
In DepthDetails ArticlePubMed
TargetIntegrin alpha-V/beta-1(Homo sapiens (Human))
University Of Strathclyde
Curated by ChEMBL
LigandPNGBDBM50464123(CHEMBL4242263)
Affinity DataIC50:  100nM. Assay description: Antagonist activity at human integrin alphaVbeta1 expressed in human A549 cells assessed as reduction in cell adhesion to GST-LAP after 30 mins by BC...
Ligand InfoPC cidPC sid
In DepthDetails ArticlePubMed
TargetPotassium voltage-gated channel subfamily H member 2(Homo sapiens (Human))
University Of Strathclyde
Curated by ChEMBL
LigandPNGBDBM50464123(CHEMBL4242263)
Affinity DataIC50: <6.31E+4nM. Assay description: Inhibition of human ERG expressed in HEK293 cells by Barracuda automated patch clamp assay
Ligand InfoPC cidPC sid
In DepthDetails ArticlePubMed
TargetIntegrin alpha-V/beta-5(Homo sapiens (Human))
University Of Strathclyde
Curated by ChEMBL
LigandPNGBDBM50464123(CHEMBL4242263)
Affinity DataIC50:  2.00E+3nM. Assay description: Antagonist activity at human integrin alphaVbeta5 expressed in human K562 cells assessed as reduction in cell adhesion to vitronectin after 30 mins b...
Ligand InfoPC cidPC sid
In DepthDetails ArticlePubMed
TargetIntegrin alpha-V/beta-8(Homo sapiens (Human))
University Of Strathclyde
Curated by ChEMBL
LigandPNGBDBM50464123(CHEMBL4242263)
Affinity DataIC50:  10nM. Assay description: Antagonist activity at human integrin alphaVbeta8 expressed in human K562 cells assessed as reduction in cell adhesion to GST-LAP after 30 mins by BC...
Ligand InfoPC cidPC sid
In DepthDetails ArticlePubMed
TargetPotassium voltage-gated channel subfamily H member 2(Homo sapiens (Human))
University Of Strathclyde
Curated by ChEMBL
LigandPNGBDBM50464123(CHEMBL4242263)
Affinity DataIC50: <3.16E+4nM. Assay description: Inhibition of human ERG expressed in HEK293 cells by Q-patch assay
Ligand InfoPC cidPC sid
In DepthDetails ArticlePubMed
TargetIntegrin alpha-V/beta-3(Homo sapiens (Human))
University Of Strathclyde
Curated by ChEMBL
LigandPNGBDBM50464123(CHEMBL4242263)
Affinity DataIC50:  3.16E+3nM. Assay description: Antagonist activity at human integrin alphaVbeta3 expressed in human K562 cells assessed as reduction in cell adhesion to GST-LAP after 30 mins by BC...
Ligand InfoPC cidPC sid
In DepthDetails ArticlePubMed
TargetIntegrin alpha-V/beta-6(Homo sapiens (Human))
University Of Strathclyde
Curated by ChEMBL
LigandPNGBDBM50464123(CHEMBL4242263)
Affinity DataIC50:  7.90nM. Assay description: Antagonist activity at human integrin alphaVbeta6 expressed in human K562 cells assessed as reduction in cell adhesion to GST-LAP after 30 mins by BC...
Ligand InfoPC cidPC sid
In DepthDetails ArticlePubMed