BDBM50464130 CHEMBL4246358
SMILES CO[C@H]1CNC[C@@H](OCC2CCOCC2)[C@@H]1Nc1ncc(-c2cncc(C)c2)c2cc(C)c(=O)[nH]c12
InChI Key InChIKey=ABJQAENUBLTFQM-JBRSBNLGSA-N
Data  2 IC50
  Tab Delimited (TSV)   2D SDfile   Computed 3D by Vconf -m prep SDfile
Find this compound or compounds like it in BindingDB:
Activity Spreadsheet -- Enzyme Inhibition Constant Data from BindingDB
Found 2 hits for monomerid = 50464130
TargetATPase family AAA domain-containing protein 2(Homo sapiens (Human))
Glaxosmithkline
Curated by ChEMBL
LigandPNGBDBM50464130(CHEMBL4246358)
Affinity DataIC50:  200nM. Assay description: Inhibition of N-terminal FLAG-6His-tagged TEV-fused ATAD2 (981 to 1121 residues) (unknown origin) expressed in Escherichia coli BL21(DE3) after 30 mi...
Ligand InfoPC cidPC sid
In DepthDetails ArticlePubMed
TargetBromodomain-containing protein 4(Homo sapiens (Human))
Glaxosmithkline
Curated by ChEMBL
LigandPNGBDBM50464130(CHEMBL4246358)
Affinity DataIC50:  3.16E+4nM. Assay description: Inhibition of 6His-tagged Thr-BRD4 (BD1) (1 to 477 residues) (unknown origin) expressed in Escherichia coli BL21(DE3) after 30 mins in presence of bi...
Ligand InfoPC cidPC sid
In DepthDetails ArticlePubMed