BDBM50464580 CHEMBL4277461
SMILES CC[C@H](C)[C@H](NC(=O)[C@H](CC(N)=O)NC(=O)[C@H](CC(C)C)NC(=O)[C@@H]1CCCN1C(=O)[C@@H]1CCCN1C(=O)[C@H](Cc1cnc[nH]1)NC(=O)[C@@H](NC(=O)[C@@H](NC(=O)[C@@H]1CCCN1C(=O)[C@H](CC(N)=O)NC(=O)[C@@H](N)CCC(O)=O)C(C)C)C(C)C)C(=O)N[C@@H](C(C)C)C(=O)N[C@@H]([C@@H](C)O)C(=O)N1CCC[C@H]1C(=O)N[C@@H](CCCNC(N)=N)C(O)=O
InChI Key InChIKey=FJFPGDXPRWHTPR-HDQYJMDWSA-N
Data  2 IC50
  Tab Delimited (TSV)   2D SDfile   Computed 3D by Vconf -m prep SDfile
Find this compound or compounds like it in BindingDB:
Activity Spreadsheet -- Enzyme Inhibition Constant Data from BindingDB
Found 2 hits for monomerid = 50464580
TargetMHC class II antigen(Homo sapiens (Human))
University Of Patras
Curated by ChEMBL
LigandPNGBDBM50464580(CHEMBL4277461)
Affinity DataIC50:  87nM. Assay description: Inhibition of biotin-labeled MBP (85 to 99 residues) binding to HLA class 2 DRB1*0101 mutant allele after 2 hrs by TMB + substrate-chromogen based as...
Ligand InfoKEGGPC cidPC sid
In DepthDetails ArticlePubMed
TargetMHC class II antigen(Homo sapiens (Human))
University Of Patras
Curated by ChEMBL
LigandPNGBDBM50464580(CHEMBL4277461)
Affinity DataIC50:  13nM. Assay description: Inhibition of biotin-labeled MBP (85 to 99 residues) binding to HLA class 2 DRB1*1501 mutant allele after 2 hrs by TMB + substrate-chromogen based as...
Ligand InfoKEGGPC cidPC sid
In DepthDetails ArticlePubMed