BDBM50464631 CHEMBL4288327::US11091476, Example 29
SMILES CCC1(CC)C(C)=Nc2c1cc(cc2F)-c1nc(Nc2ccc(cn2)N2CCNCC2)ncc1F
InChI Key InChIKey=HOKDQPMWTBQYHL-UHFFFAOYSA-N
Data  5 IC50
  Tab Delimited (TSV)   2D SDfile   Computed 3D by Vconf -m prep SDfile
Find this compound or compounds like it in BindingDB:
Activity Spreadsheet -- Enzyme Inhibition Constant Data from BindingDB
Found 5 hits for monomerid = 50464631
TargetCyclin-dependent kinase 6/G1/S-specific cyclin-D3(Homo sapiens (Human))
Beijing Normal University
Curated by ChEMBL
LigandPNGBDBM50464631(CHEMBL4288327 | US11091476, Example 29)
Affinity DataIC50:  3nM. Assay description: Inhibition of CDK6/Cyclin-D3 (unknown origin) using histoneH1 as substrate after 90 mins by ADP-Glo assay
Ligand InfoPC cidPC sid
In DepthDetails ArticlePubMed
TargetCyclin-A2/Cyclin-dependent kinase 1(Homo sapiens (Human))
Beijing Normal University
Curated by ChEMBL
LigandPNGBDBM50464631(CHEMBL4288327 | US11091476, Example 29)
Affinity DataIC50:  82nM. Assay description: Inhibition of CDK1/Cyclin-A2 (unknown origin) using histone-H1 as substrate after 90 mins by ADP-Glo assay
Ligand InfoPC cidPC sid
In DepthDetails ArticlePubMed
TargetCyclin-dependent kinase 6/G1/S-specific cyclin-D3(Homo sapiens (Human))
Beijing Normal University
Curated by ChEMBL
LigandPNGBDBM50464631(CHEMBL4288327 | US11091476, Example 29)
Affinity DataIC50:  3.15nM. Assay description:  1.2.2 Preparation of kinase solution: Kinase solutions having the concentrations required for each reaction system were prepared from 100 ng/...
Ligand InfoPC cidPC sid
In DepthDetails US Patent
TargetCyclin-dependent kinase/G1/S-specific cyclin- 2(Homo sapiens (Human))
Gan & Lee Pharmaceuticals
US Patent
LigandPNGBDBM50464631(CHEMBL4288327 | US11091476, Example 29)
Affinity DataIC50:  82.4nM. Assay description:  1.2.2 Preparation of kinase solution: Kinase solutions having the concentrations required for each reaction system were prepared from 100 ng/...
Ligand InfoPC cidPC sid
In DepthDetails US Patent
TargetCyclin-dependent kinase 4/G1/S-specific cyclin-D1(Homo sapiens (Human))
Beijing Normal University
Curated by ChEMBL
LigandPNGBDBM50464631(CHEMBL4288327 | US11091476, Example 29)
Affinity DataIC50:  3nM. Assay description: Inhibition of CDK4/Cyclin-D1 (unknown origin) using histone-H1 as substrate after 90 mins by ADP-Glo assay
Ligand InfoPC cidPC sid
In DepthDetails ArticlePubMed