BDBM50464970 CHEMBL4281477
SMILES C[C@H](NC(=O)[C@H](Cc1ccc(OCc2ccccc2)cc1)NC(=O)OC(C)(C)C)C(=O)N[C@@H](C[C@]1(O)C(=O)Nc2ccccc12)C(=O)NCCC1CCCCC1
InChI Key InChIKey=NKAQETKGROVPKJ-MPZLWCBZSA-N
Data  4 IC50
  Tab Delimited (TSV)   2D SDfile   Computed 3D by Vconf -m prep SDfile
Find this compound or compounds like it in BindingDB:
Activity Spreadsheet -- Enzyme Inhibition Constant Data from BindingDB
Found 4 hits for monomerid = 50464970
TargetProteasome subunit beta type-8(Homo sapiens (Human))
Universit£
Curated by ChEMBL
LigandPNGBDBM50464970(CHEMBL4281477)
Affinity DataIC50:  2.70E+3nM. Assay description: Inhibition of human 20S immunoproteasome beta-5 using Suc-LLVY-AMC as substrate incubated for 15 mins measured for 45 mins by fluorescence assay
Ligand InfoPC cidPC sid
In DepthDetails ArticlePubMed
TargetProteasome subunit beta type-1(Homo sapiens (Human))
Universit£
Curated by ChEMBL
LigandPNGBDBM50464970(CHEMBL4281477)
Affinity DataIC50:  2.70E+3nM. Assay description: Inhibition of human 20S constitutive proteasome beta-1 using Z-LLE-betaNA as substrate incubated for 15 mins measured for 45 mins by fluorescence ass...
Ligand InfoPC cidPC sid
In DepthDetails ArticlePubMed
TargetProteasome subunit beta type-9(Homo sapiens (Human))
Universit£
Curated by ChEMBL
LigandPNGBDBM50464970(CHEMBL4281477)
Affinity DataIC50:  3.50E+3nM. Assay description: Inhibition of human 20S immunoproteasome beta-1 using Ac-PAL-AMC as substrate incubated for 15 mins measured for 45 mins by fluorescence assay
Ligand InfoPC cidPC sid
In DepthDetails ArticlePubMed
TargetProteasome subunit beta type-5(Homo sapiens (Human))
Universit£
Curated by ChEMBL
LigandPNGBDBM50464970(CHEMBL4281477)
Affinity DataIC50:  2.80E+3nM. Assay description: Inhibition of human 20S constitutive proteasome beta-5 using Suc-LLVY-AMC as substrate incubated for 15 mins measured for 45 mins by fluorescence ass...
Ligand InfoPC cidPC sid
In DepthDetails ArticlePubMed