BDBM50465345 18-Oxoferruginol::acs.jmedchem.1c00409_ST.768
SMILES [H][C@@]12CCc3cc(C(C)C)c(O)cc3[C@@]1(C)CCC[C@@]2(C)C=O
InChI Key InChIKey=BYISLTMARMJFNI-SLFFLAALSA-N
Data  4 IC50
  Tab Delimited (TSV)   2D SDfile   Computed 3D by Vconf -m prep SDfile
Find this compound or compounds like it in BindingDB:
Activity Spreadsheet -- Enzyme Inhibition Constant Data from BindingDB
Found 4 hits for monomerid = 50465345
TargetLysine--tRNA ligase(Homo sapiens (Human))
Yunnan University
Curated by ChEMBL
LigandPNGBDBM50465345(18-Oxoferruginol | acs.jmedchem.1c00409_ST.768)
Affinity DataIC50:  34nM. Assay description: Inhibition of SYK (unknown origin) by mobility shift assay
Ligand InfoPC cidPC sid
In DepthDetails ArticlePubMed
TargetReplicase polyprotein 1ab(Human SARS coronavirus (SARS-CoV) (Severe acute re...)
Michigan State University
LigandPNGBDBM50465345(18-Oxoferruginol | acs.jmedchem.1c00409_ST.768)
Affinity DataIC50:  1.63E+5nM. Assay description: This is a review article. Please point to the original journal.
Ligand InfoPC cidPC sid
In DepthDetails ArticlePubMed
TargetReplicase polyprotein 1ab(Human SARS coronavirus (SARS-CoV) (Severe acute re...)
Michigan State University
LigandPNGBDBM50465345(18-Oxoferruginol | acs.jmedchem.1c00409_ST.768)
Affinity DataIC50:  1.63E+5nM. Assay description: Inhibition of SARS coronavirus 3C-like protease after 60 mins by FRET assay
Ligand InfoPC cidPC sid
In DepthDetails ArticlePubMed
TargetTyrosine-protein kinase JAK3(Homo sapiens (Human))
Yunnan University
Curated by ChEMBL
LigandPNGBDBM50465345(18-Oxoferruginol | acs.jmedchem.1c00409_ST.768)
Affinity DataIC50: >100nM. Assay description: Inhibition of JAK3 (unknown origin) by mobility shift assay
Ligand InfoPC cidPC sid
In DepthDetails ArticlePubMed