BDBM50466005 CHEMBL4280913
SMILES Nc1cccc(c1)-c1ccc(s1)C(=O)c1cc(F)c(F)c(O)c1F
InChI Key InChIKey=QVAYMJDZQBQRGP-UHFFFAOYSA-N
Data  2 IC50
  Tab Delimited (TSV)   2D SDfile   Computed 3D by Vconf -m prep SDfile
Find this compound or compounds like it in BindingDB:
Activity Spreadsheet -- Enzyme Inhibition Constant Data from BindingDB
Found 2 hits for monomerid = 50466005
Target17-beta-hydroxysteroid dehydrogenase type 1(Homo sapiens (Human))
Pharmbiotec
Curated by ChEMBL
LigandPNGBDBM50466005(CHEMBL4280913)
Affinity DataIC50:  49nM. Assay description: Inhibition of human placental cytosolic 17beta-HSD1 using [3H]-E1 as substrate after 10 mins in presence of NADPH by radio-flow detector based analys...
Ligand InfoPC cidPC sid
In DepthDetails ArticlePubMed
Target17-beta-hydroxysteroid dehydrogenase type 2(Homo sapiens (Human))
Pharmbiotec
Curated by ChEMBL
LigandPNGBDBM50466005(CHEMBL4280913)
Affinity DataIC50:  5.40nM. Assay description: Inhibition of human placental microsomal fraction 17beta-HSD2 using [3H]-E2 as substrate after 20 mins in presence of NAD+ by radio-flow detector bas...
Ligand InfoPC cidPC sid
In DepthDetails ArticlePubMed