BDBM50466205 CHEMBL4285083
SMILES CC1CN(CC(C)O1)C(=O)c1ccc(Nc2nc(ccc2C(N)=O)N2CC[C@@H](C2)NC(=O)C=C)cc1
InChI Key InChIKey=GZXNPYNLEUZRFM-UHYCVJNDSA-N
Data  2 IC50
  Tab Delimited (TSV)   2D SDfile   Computed 3D by Vconf -m prep SDfile
Find this compound or compounds like it in BindingDB:
Activity Spreadsheet -- Enzyme Inhibition Constant Data from BindingDB
Found 2 hits for monomerid = 50466205
TargetPotassium voltage-gated channel subfamily H member 2(Homo sapiens (Human))
Emd Serono Research & Development Institute
Curated by ChEMBL
LigandPNGBDBM50466205(CHEMBL4285083)
Affinity DataIC50: >1.00E+4nM. Assay description: Inhibition of human ERG
Ligand InfoPC cidPC sid
In DepthDetails ArticlePubMed
TargetTyrosine-protein kinase BTK(Homo sapiens (Human))
Emd Serono Research & Development Institute
Curated by ChEMBL
LigandPNGBDBM50466205(CHEMBL4285083)
Affinity DataIC50:  2.80nM. Assay description: Inhibition of full length human BTK (8 to 80 residues) using FITC-AHA-EEPLYWSFPAKKK-NH2 as substrate after 90 mins by off-chip mobility shift assay
Ligand InfoPC cidPC sid
In DepthDetails ArticlePubMed