BDBM50467209 CHEMBL4291446
SMILES COc1cc(Oc2nc(O[C@@H](C(O)=O)C(C)(C)C)c(F)cc2F)cc(c1)-c1cccc(CN)c1
InChI Key InChIKey=WWBGDPBRUAWUAY-NRFANRHFSA-N
Data  3 IC50
  Tab Delimited (TSV)   2D SDfile   Computed 3D by Vconf -m prep SDfile
Find this compound or compounds like it in BindingDB:
Activity Spreadsheet -- Enzyme Inhibition Constant Data from BindingDB
Found 3 hits for monomerid = 50467209
TargetUrokinase-type plasminogen activator(Homo sapiens (Human))
Abdulaziz University For Health Sciences
Curated by ChEMBL
LigandPNGBDBM50467209(CHEMBL4291446)
Affinity DataIC50:  23nM. Assay description: Inhibition of human uPA
Ligand InfoPC cidPC sid
In DepthDetails ArticlePubMed
TargetPlasminogen(Homo sapiens (Human))
Abdulaziz University For Health Sciences
Curated by ChEMBL
LigandPNGBDBM50467209(CHEMBL4291446)
Affinity DataIC50:  3.33E+3nM. Assay description: Inhibition of human plasmin
Ligand InfoPC cidPC sid
In DepthDetails ArticlePubMed
TargetTissue-type plasminogen activator(Homo sapiens (Human))
Abdulaziz University For Health Sciences
Curated by ChEMBL
LigandPNGBDBM50467209(CHEMBL4291446)
Affinity DataIC50:  1.85E+3nM. Assay description: Inhibition of human tPA
Ligand InfoPC cidPC sid
In DepthDetails ArticlePubMed