BDBM50467762 CHEMBL4282948
SMILES [O-][N+](=O)c1ccc(Nc2c(oc3c(Cl)cc(Cl)cc3c2=O)-c2ccco2)cc1
InChI Key InChIKey=ZIHFIXFMDMDJAB-UHFFFAOYSA-N
Data  1 IC50
  Tab Delimited (TSV)   2D SDfile   Computed 3D by Vconf -m prep SDfile
Find this compound or compounds like it in BindingDB:
Activity Spreadsheet -- Enzyme Inhibition Constant Data from BindingDB
Found 1 hit for monomerid = 50467762
TargetMAP/microtubule affinity-regulating kinase 4(Homo sapiens (Human))
Indian Institute Of Technology Roorkee
Curated by ChEMBL
LigandPNGBDBM50467762(CHEMBL4282948)
Affinity DataIC50:  2.12E+3nM. Assay description: Inhibition of MARK4 (unknown origin) (59 to 368 residues) expressed in Escherichia coli M15 in presence of [gamma-32P]ATP by ATPase assay
Ligand InfoPC cidPC sid
In DepthDetails ArticlePubMed