BDBM50467796 CHEMBL4285558
SMILES COc1cc2c(nc(NCCCn3ccnc3)nc2cc1OCCCN1CCCC1)N1CCN(CC1)C1CCCC1
InChI Key InChIKey=HAXOFXNCHNPSBZ-UHFFFAOYSA-N
Data  3 IC50
  Tab Delimited (TSV)   2D SDfile   Computed 3D by Vconf -m prep SDfile
Find this compound or compounds like it in BindingDB:
Activity Spreadsheet -- Enzyme Inhibition Constant Data from BindingDB
Found 3 hits for monomerid = 50467796
TargetToll-like receptor 9(Homo sapiens (Human))
Csir-Indian Institute Of Chemical Biology
Curated by ChEMBL
LigandPNGBDBM50467796(CHEMBL4285558)
Affinity DataIC50:  50nM. Assay description: Antagonist activity at human TLR9 expressed in HEK-Blue cells assessed as reduction in CpGB-induced NF-kappaB levels after 24 hrs by spectrophotometr...
Ligand InfoPC cidPC sid
In DepthDetails ArticlePubMed
TargetToll-like receptor 7(Homo sapiens (Human))
Csir-Indian Institute Of Chemical Biology
Curated by ChEMBL
LigandPNGBDBM50467796(CHEMBL4285558)
Affinity DataIC50:  1.70E+4nM. Assay description: Antagonist activity at TLR7 (unknown origin)
Ligand InfoPC cidPC sid
In DepthDetails ArticlePubMed
TargetToll-like receptor 7(Homo sapiens (Human))
Csir-Indian Institute Of Chemical Biology
Curated by ChEMBL
LigandPNGBDBM50467796(CHEMBL4285558)
Affinity DataIC50:  1.70E+4nM. Assay description: Antagonist activity at human TLR7 expressed in HEK-Blue cells assessed as reduction in CL264-induced NF-kappaB levels after 24 hrs by spectrophotomet...
Ligand InfoPC cidPC sid
In DepthDetails ArticlePubMed