BDBM50467924 CHEMBL4287062
SMILES COc1cc2CCN(CCCCNC(=O)c3ccc4ccccc4c3)Cc2cc1O
InChI Key InChIKey=BVFIHIUYFGGHND-UHFFFAOYSA-N
Data  4 KI
  Tab Delimited (TSV)   2D SDfile   Computed 3D by Vconf -m prep SDfile
Find this compound or compounds like it in BindingDB:
Activity Spreadsheet -- Enzyme Inhibition Constant Data from BindingDB
Found 4 hits for monomerid = 50467924
TargetD(3) dopamine receptor(Homo sapiens (Human))
City University Of New York
Curated by ChEMBL
LigandPNGBDBM50467924(CHEMBL4287062)
Affinity DataKi:  2.70nM. Assay description: Displacement of [3H]N-Methylspiperone from human dopamine D3 receptor expressed in HEKT cell membranes
Ligand InfoPC cidPC sid
In DepthDetails ArticlePubMed
TargetD(4) dopamine receptor(Homo sapiens (Human))
City University Of New York
Curated by ChEMBL
LigandPNGBDBM50467924(CHEMBL4287062)
Affinity DataKi:  170nM. Assay description: Displacement of [3H]N-Methylspiperone from human dopamine D4 receptor expressed in HEK cell membranes
Ligand InfoPC cidPC sid
In DepthDetails ArticlePubMed
TargetD(2) dopamine receptor(Homo sapiens (Human))
City University Of New York
Curated by ChEMBL
LigandPNGBDBM50467924(CHEMBL4287062)
Affinity DataKi:  700nM. Assay description: Displacement of [3H]N-Methylspiperone from human dopamine D2 receptor expressed in fibroblasts
Ligand InfoPC cidPC sid
In DepthDetails ArticlePubMed
TargetD(1A) dopamine receptor(Homo sapiens (Human))
City University Of New York
Curated by ChEMBL
LigandPNGBDBM50467924(CHEMBL4287062)
Affinity DataKi:  800nM. Assay description: Displacement of [3H]SCH23390 from human dopamine D1 receptor expressed in HEKT cell membranes
Ligand InfoPC cidPC sid
In DepthDetails ArticlePubMed