BDBM50467930 CHEMBL4293886
SMILES COc1ccc(cc1)C(=O)NCCCCN1CCc2cc(OC)c(O)cc2C1
InChI Key InChIKey=JFKCCUAHUNXNFQ-UHFFFAOYSA-N
Data  2 KI  1 EC50
  Tab Delimited (TSV)   2D SDfile   Computed 3D by Vconf -m prep SDfile
Find this compound or compounds like it in BindingDB:
Activity Spreadsheet -- Enzyme Inhibition Constant Data from BindingDB
Found 3 hits for monomerid = 50467930
TargetD(3) dopamine receptor(Homo sapiens (Human))
City University Of New York
Curated by ChEMBL
LigandPNGBDBM50467930(CHEMBL4293886)
Affinity DataKi:  5.90nM. Assay description: Displacement of [3H]N-Methylspiperone from human dopamine D3 receptor expressed in HEKT cell membranes
Ligand InfoPC cidPC sid
In DepthDetails ArticlePubMed
TargetD(4) dopamine receptor(Homo sapiens (Human))
City University Of New York
Curated by ChEMBL
LigandPNGBDBM50467930(CHEMBL4293886)
Affinity DataKi:  560nM. Assay description: Displacement of [3H]N-Methylspiperone from human dopamine D4 receptor expressed in HEK cell membranes
Ligand InfoPC cidPC sid
In DepthDetails ArticlePubMed
TargetD(3) dopamine receptor(Homo sapiens (Human))
City University Of New York
Curated by ChEMBL
LigandPNGBDBM50467930(CHEMBL4293886)
Affinity DataEC50:  360nM. Assay description: Antagonist activity at human dopamine D3 receptor assessed as inhibition of beta-arrestin recruitment by Tango assay
Ligand InfoPC cidPC sid
In DepthDetails ArticlePubMed