BDBM50467933 CHEMBL4294279
SMILES COc1cc2CCN(CCCCNC(=O)c3ccc(O)cc3)Cc2cc1O
InChI Key InChIKey=HTIHIBRTTCYUMB-UHFFFAOYSA-N
Data  2 KI  1 EC50
  Tab Delimited (TSV)   2D SDfile   Computed 3D by Vconf -m prep SDfile
Find this compound or compounds like it in BindingDB:
Activity Spreadsheet -- Enzyme Inhibition Constant Data from BindingDB
Found 3 hits for monomerid = 50467933
TargetD(3) dopamine receptor(Homo sapiens (Human))
City University Of New York
Curated by ChEMBL
LigandPNGBDBM50467933(CHEMBL4294279)
Affinity DataKi:  8.70nM. Assay description: Displacement of [3H]N-Methylspiperone from human dopamine D3 receptor expressed in HEKT cell membranes
Ligand InfoPC cidPC sid
In DepthDetails ArticlePubMed
TargetD(4) dopamine receptor(Homo sapiens (Human))
City University Of New York
Curated by ChEMBL
LigandPNGBDBM50467933(CHEMBL4294279)
Affinity DataKi:  660nM. Assay description: Displacement of [3H]N-Methylspiperone from human dopamine D4 receptor expressed in HEK cell membranes
Ligand InfoPC cidPC sid
In DepthDetails ArticlePubMed
TargetD(3) dopamine receptor(Homo sapiens (Human))
City University Of New York
Curated by ChEMBL
LigandPNGBDBM50467933(CHEMBL4294279)
Affinity DataEC50:  420nM. Assay description: Antagonist activity at human dopamine D3 receptor assessed as inhibition of beta-arrestin recruitment by Tango assay
Ligand InfoPC cidPC sid
In DepthDetails ArticlePubMed