BDBM50468029 CHEMBL4282357
SMILES Cc1coc2c1c(=O)oc(=O)c1c2ccc2c(C)cccc12
InChI Key InChIKey=KHARNRTVXDAWSR-UHFFFAOYSA-N
Data  1 KI  2 IC50
  Tab Delimited (TSV)   2D SDfile   Computed 3D by Vconf -m prep SDfile
Find this compound or compounds like it in BindingDB:
Activity Spreadsheet -- Enzyme Inhibition Constant Data from BindingDB
Found 3 hits for monomerid = 50468029
TargetLiver carboxylesterase 1(Homo sapiens (Human))
St. Jude Children'S Research Hospital
Curated by ChEMBL
LigandPNGBDBM50468029(CHEMBL4282357)
Affinity DataKi:  2.40nM. Assay description: Inhibition of human CE1 using o-NPA as substrate
Ligand InfoPC cidPC sid
In DepthDetails ArticlePubMed
TargetCholinesterase(Homo sapiens (Human))
St. Jude Children'S Research Hospital
Curated by ChEMBL
LigandPNGBDBM50468029(CHEMBL4282357)
Affinity DataIC50: >1.00E+4nM. Assay description: Inhibition of human BuChE using butyrylhiocholine as substrate
Ligand InfoPC cidPC sid
In DepthDetails ArticlePubMed
TargetAcetylcholinesterase(Homo sapiens (Human))
St. Jude Children'S Research Hospital
Curated by ChEMBL
LigandPNGBDBM50468029(CHEMBL4282357)
Affinity DataIC50: >1.00E+4nM. Assay description: Inhibition of human AChE using acetylthiocholine as substrate
Ligand InfoPC cidPC sid
In DepthDetails ArticlePubMed