BDBM50468073 CHEMBL4293036
SMILES Oc1c(Br)cccc1C(=O)Nc1cccc(Cl)c1
InChI Key InChIKey=LJTQVIFOJANPHH-UHFFFAOYSA-N
Data  4 IC50
  Tab Delimited (TSV)   2D SDfile   Computed 3D by Vconf -m prep SDfile
Find this compound or compounds like it in BindingDB:
Activity Spreadsheet -- Enzyme Inhibition Constant Data from BindingDB
Found 4 hits for monomerid = 50468073
TargetCo-chaperonin GroES(Escherichia coli)
Indiana University School Of Medicine
Curated by ChEMBL
LigandPNGBDBM50468073(CHEMBL4293036)
Affinity DataIC50: >1.00E+5nM. Assay description: Inhibition of Escherichia coli GroEL expressed in Escherichia coli DH5alpha/Escherichia coli GroES expressed in Escherichia coli BL21 (DE3) assessed ...
Ligand InfoPC cidPC sid
In DepthDetails ArticlePubMed
Target60 kDa heat shock protein, mitochondrial(Homo sapiens)
Indiana University School Of Medicine
Curated by ChEMBL
LigandPNGBDBM50468073(CHEMBL4293036)
Affinity DataIC50: >1.00E+5nM. Assay description: Inhibition of human N-terminal octa-His-tagged HSP60 expressed in Escherichia coli Rosetta(DE3) pLysS/human HSP10 expressed in Escherichia coli Roset...
Ligand InfoPC cidPC sid
In DepthDetails ArticlePubMed
TargetThiosulfate sulfurtransferase(Homo sapiens)
Indiana University School Of Medicine
Curated by ChEMBL
LigandPNGBDBM50468073(CHEMBL4293036)
Affinity DataIC50: >1.00E+5nM. Assay description: Inhibition of refolded rhodanese (unknown origin) preincubated with Escherichia coli GroEL/GroES for 60 mins in absence of compound followed by compo...
Ligand InfoPC cidPC sid
In DepthDetails ArticlePubMed
TargetCo-chaperonin GroES(Escherichia coli)
Indiana University School Of Medicine
Curated by ChEMBL
LigandPNGBDBM50468073(CHEMBL4293036)
Affinity DataIC50: >1.00E+5nM. Assay description: Inhibition of Escherichia coli GroEL expressed in Escherichia coli DH5alpha/Escherichia coli GroES expressed in Escherichia coli BL21 (DE3) assessed ...
Ligand InfoPC cidPC sid
In DepthDetails ArticlePubMed