BDBM50468429 CHEMBL4279608
SMILES CCCCCCCCCC(=O)CC(=O)N[C@H]1CCOC1
InChI Key InChIKey=IWYXZAIHGCVLSG-AWEZNQCLSA-N
Data  2 EC50
  Tab Delimited (TSV)   2D SDfile   Computed 3D by Vconf -m prep SDfile
Find this compound or compounds like it in BindingDB:
Activity Spreadsheet -- Enzyme Inhibition Constant Data from BindingDB
Found 2 hits for monomerid = 50468429
TargetQuorum-sensing transcriptional repressor QscR(Pseudomonas aeruginosa)
University Of Wisconsin-Madison
Curated by ChEMBL
LigandPNGBDBM50468429(CHEMBL4279608)
Affinity DataEC50:  815nM. Assay description: Agonist activity at Pseudomonas aeruginosa QscR expressed in Escherichia coli JLD271 harboring QscR expression plasmid pJN105Q and pPA1897-lacZ trans...
Ligand InfoPC cidPC sid
In DepthDetails ArticlePubMed
TargetTranscriptional activator protein LasR(Pseudomonas aeruginosa)
University Of Wisconsin-Madison
Curated by ChEMBL
LigandPNGBDBM50468429(CHEMBL4279608)
Affinity DataEC50:  906nM. Assay description: Agonist activity at Pseudomonas aeruginosa LasR expressed in Escherichia coli JLD271 harboring LasR expression plasmid pJN105L and lasI-lacZ transcri...
Ligand InfoPC cidPC sid
In DepthDetails ArticlePubMed