BDBM50468982 CHEMBL4289728
SMILES N=c1oc2ccccc2cc1C(=O)N\N=C1/C(=O)Nc2ccc(cc12)S(=O)(=O)N1CCOCC1
InChI Key InChIKey=FWLJCTLMPZOFIK-UHFFFAOYSA-N
Data  1 IC50
  Tab Delimited (TSV)   2D SDfile   Computed 3D by Vconf -m prep SDfile
Find this compound or compounds like it in BindingDB:
Activity Spreadsheet -- Enzyme Inhibition Constant Data from BindingDB
Found 1 hit for monomerid = 50468982
TargetEpidermal growth factor receptor(Homo sapiens (Human))
Al-Azhar University
Curated by ChEMBL
LigandPNGBDBM50468982(CHEMBL4289728)
Affinity DataIC50:  205nM. Assay description: Inhibition of EGFR in human HepG2 cells
Ligand InfoPC cidPC sid
In DepthDetails ArticlePubMed