BDBM50469155 CHEMBL4288133
SMILES [H][C@]12C[C@@]3([H])OB(O[C@@]3([H])C1)[C@H](C)NC(=O)[C@H](Cc1cn(CCO2)nn1)NC(=O)[C@H](C)NC(=O)[C@@H](NC(=O)[C@H](CCCN)NC(=O)c1ccc(=O)n(c1)-c1ccccc1)[C@@H](C)O
InChI Key InChIKey=HRMYNPOCFYHMKD-FAIUEKCWSA-N
Data  1 IC50
  Tab Delimited (TSV)   2D SDfile   Computed 3D by Vconf -m prep SDfile
Find this compound or compounds like it in BindingDB:
Activity Spreadsheet -- Enzyme Inhibition Constant Data from BindingDB
Found 1 hit for monomerid = 50469155
TargetSignal peptidase I(Escherichia coli (strain K12))
Uppsala University
Curated by ChEMBL
LigandPNGBDBM50469155(CHEMBL4288133)
Affinity DataIC50:  1.66E+3nM. Assay description: Inhibition of Escherichia coli type 1 signal peptidase lepB preincubated for 10 mins followed by Dabcyl-VGGTATAYGAFSRPGLE-(EDANS)-OH substrate additi...
Ligand InfoPC cidPC sid
In DepthDetails ArticlePubMed