BDBM50469748 CHEMBL422025::Ro-091571
SMILES CCCCCCC\C=C\C[C@@H]1OC[C@H](C)[C@H](OC)[C@H]1COC(=O)CN
InChI Key InChIKey=ICTGJZPXIHOPOV-SRDMDYHBSA-N
Data  1 IC50
  Tab Delimited (TSV)   2D SDfile   Computed 3D by Vconf -m prep SDfile
Find this compound or compounds like it in BindingDB:
Activity Spreadsheet -- Enzyme Inhibition Constant Data from BindingDB
Found 1 hit for monomerid = 50469748
TargetLanosterol 14-alpha demethylase(Homo sapiens (Human))TBA
LigandPNGBDBM50469748(CHEMBL422025 | Ro-091571)
Affinity DataIC50:  225nM. Assay description: In vitro inhibition of Lanosterol 14-alpha demethylase (Candida albicans CY1005)
Ligand InfoPC cidPC sid
In DepthDetails Article