BDBM50469989 CHEMBL419024
SMILES COc1ccc2cccc(CCNC(=O)C3CCCC3)c2c1
InChI Key InChIKey=RXNMPTACBCBTNK-UHFFFAOYSA-N
Data  1 IC50  1 Kd
  Tab Delimited (TSV)   2D SDfile   Computed 3D by Vconf -m prep SDfile
Find this compound or compounds like it in BindingDB:
Activity Spreadsheet -- Enzyme Inhibition Constant Data from BindingDB
Found 2 hits for monomerid = 50469989
TargetMelatonin receptor type 1A/1B(Homo sapiens (Human))
Institut De Chimie Pharmaceutique
Curated by ChEMBL
LigandPNGBDBM50469989(CHEMBL419024)
Affinity DataIC50:  307nM. Assay description: Monophasic inhibitory concentration against melatonin receptor was measured on ovine pars tuberalis membrane.
Ligand InfoPC cidPC sid
In DepthDetails ArticlePubMed
TargetMelatonin receptor type 1A/1B(Homo sapiens (Human))
Institut De Chimie Pharmaceutique
Curated by ChEMBL
LigandPNGBDBM50469989(CHEMBL419024)
Affinity DataKd:  190nM. Assay description: Binding affinity to melatonin receptor measured on ovine pars tuberalis membrane
Ligand InfoPC cidPC sid
In DepthDetails ArticlePubMed