BDBM50470183 CHEMBL305383
SMILES CCC(=O)NCCc1cc(Br)ccc1OC
InChI Key InChIKey=ODRINGCBXAYUEY-UHFFFAOYSA-N
Data  2 KI
  Tab Delimited (TSV)   2D SDfile   Computed 3D by Vconf -m prep SDfile
Find this compound or compounds like it in BindingDB:
Activity Spreadsheet -- Enzyme Inhibition Constant Data from BindingDB
Found 2 hits for monomerid = 50470183
TargetMelatonin receptor type 1C(Gallus gallus)
Universit£
Curated by ChEMBL
LigandPNGBDBM50470183(CHEMBL305383)
Affinity DataKi:  1.10nM. Assay description: Binding affinity against chicken brain melatonin receptors using 2-[125I]iodomelatonin as radioligand
In DepthDetails ArticlePubMed
TargetMelatonin receptor type 1C(Gallus gallus)
Universit£
Curated by ChEMBL
LigandPNGBDBM50470183(CHEMBL305383)
Affinity DataKi:  8nM. Assay description: Competitive binding by the displacement of 2-[125I]- Iodomelatonin binding from melatonin receptors in chicken brain membranes
In DepthDetails ArticlePubMed