BDBM50471521 CHEMBL355109
SMILES [Na+].Oc1cccc(NC(=O)\C=C\c2c([nH]c3cc(Cl)cc(Cl)c23)C([O-])=O)c1
InChI Key InChIKey=AEXSAHUNXPPRNH-SNAWJCMRSA-M
Data  1 KI
  Tab Delimited (TSV)   2D SDfile   Computed 3D by Vconf -m prep SDfile
Find this compound or compounds like it in BindingDB:
Activity Spreadsheet -- Enzyme Inhibition Constant Data from BindingDB
Found 1 hit for monomerid = 50471521
TargetGlutamate receptor ionotropic, NMDA 1(RAT)
Glaxo Wellcome
Curated by ChEMBL
LigandPNGBDBM50471521(CHEMBL355109)
Affinity DataKi:  4nM. Assay description: Inhibition of [3H]glycine to glycine binding site, associated with the N-methyl-D-aspartate glutamate receptor 1 in crude synaptic membranes prepared...
Ligand InfoPC cidPC sid
In DepthDetails ArticlePubMed