BDBM50472423 CHEMBL150744
SMILES CN(C)C(=O)C[C@]1(O)CCC[C@@H](C1)\C=C\C(F)CCCCc1ccccc1
InChI Key InChIKey=IOBHCKLJWUGODE-IFJDNBALSA-N
Data  2 IC50
  Tab Delimited (TSV)   2D SDfile   Computed 3D by Vconf -m prep SDfile
Find this compound or compounds like it in BindingDB:
Activity Spreadsheet -- Enzyme Inhibition Constant Data from BindingDB
Found 2 hits for monomerid = 50472423
TargetLeukotriene B4 receptor 2(Homo sapiens (Human))
Cnrs 5074
Curated by ChEMBL
LigandPNGBDBM50472423(CHEMBL150744)
Affinity DataIC50:  6.50E+3nM. Assay description: Inhibition of binding of [3H]LTB4 (1 nM) to intact human polymorphonuclear leukocytes (PMNs)
Ligand InfoPC cidPC sid
In DepthDetails ArticlePubMed
TargetLeukotriene B4 receptor 1/2(Homo sapiens (Human))
Cnrs 5074
Curated by ChEMBL
LigandPNGBDBM50472423(CHEMBL150744)
Affinity DataIC50:  6.50E+3nM. Assay description: Inhibition of binding of [3H]LTB4 (1 nM) to intact human polymorphonuclear leukocytes (PMNs)
Ligand InfoPC cidPC sid
In DepthDetails ArticlePubMed