BDBM50472432 CHEMBL358980
SMILES [Na;v0+].[#8]-[#6](-[#6]-[#6]-[#6]-[#6]-c1ccccc1)\[#6]=[#6]\[#6@H]-1-[#6]-[#6]-[#6][C@]([#8])([#6]-[#6](-[#8-])=O)[#6]1
InChI Key InChIKey=MJGHSHZZATUGPV-NHBAJMNDSA-M
Data  2 IC50
  Tab Delimited (TSV)   2D SDfile   Computed 3D by Vconf -m prep SDfile
Find this compound or compounds like it in BindingDB:
Activity Spreadsheet -- Enzyme Inhibition Constant Data from BindingDB
Found 2 hits for monomerid = 50472432
TargetLeukotriene B4 receptor 2(Homo sapiens (Human))
Cnrs 5074
Curated by ChEMBL
LigandPNGBDBM50472432(CHEMBL358980)
Affinity DataIC50:  1.50E+3nM. Assay description: Inhibition of binding of [3H]LTB4 (1 nM) to intact human polymorphonuclear leukocytes (PMNs)
Ligand InfoPC cidPC sid
In DepthDetails ArticlePubMed
TargetLeukotriene B4 receptor 2(Homo sapiens (Human))
Cnrs 5074
Curated by ChEMBL
LigandPNGBDBM50472432(CHEMBL358980)
Affinity DataIC50: >1.00E+4nM. Assay description: Inhibition of binding of [3H]LTB4 (1 nM) to intact human polymorphonuclear leukocytes (PMNs)
Ligand InfoPC cidPC sid
In DepthDetails ArticlePubMed