BDBM50472437 CHEMBL344518
SMILES CN(C)OC(=O)C[C@]1(O)CCC[C@@H](C1)\C=C\C(O)CCCCc1ccccc1
InChI Key InChIKey=LPYQKIWRXVPWPT-IFJDNBALSA-N
Data  1 IC50
  Tab Delimited (TSV)   2D SDfile   Computed 3D by Vconf -m prep SDfile
Find this compound or compounds like it in BindingDB:
Activity Spreadsheet -- Enzyme Inhibition Constant Data from BindingDB
Found 1 hit for monomerid = 50472437
TargetLeukotriene B4 receptor 2(Homo sapiens (Human))
Cnrs 5074
Curated by ChEMBL
LigandPNGBDBM50472437(CHEMBL344518)
Affinity DataIC50: >1.00E+4nM. Assay description: Inhibition of binding of [3H]LTB4 (1 nM) to intact human polymorphonuclear leukocytes (PMNs)
Ligand InfoPC cidPC sid
In DepthDetails ArticlePubMed