BDBM50473477 CHEMBL427791
SMILES [#6]-[#6@@H](-[#8])-[#6@H](-[#7]-[#6](=O)-[#6@H](-[#6]-c1ccc(cc1)C#N)-[#7]-[#6](=O)-[#6]-[#7]-[#6](=O)-[#6]-[#7]-[#6](=O)-[#6@@H](-[#7])-[#6]-c1ccccc1)-[#6](=O)-[#7]-[#6]-[#6](=O)-[#7]-[#6@@H](-[#6])-[#6](=O)-[#7]-[#6@@H](-[#6]-[#6]-[#6]\[#7]=[#6](\[#7])-[#7])-[#6](=O)-[#7]-[#6@@H](-[#6]-[#6]-[#6]-[#6]-[#7])-[#6](=O)-[#7]-[#6@@H](-[#6]-[#8])-[#6](=O)-[#7]-[#6@@H](-[#6])-[#6](=O)-[#7]-[#6@@H](-[#6]-[#6]-[#6]\[#7]=[#6](\[#7])-[#7])-[#6](=O)-[#7]-[#6@@H](-[#6]-[#6]-[#6]-[#6]-[#7])-[#6](-[#7])=O
InChI Key InChIKey=VCRGHFNMKLNZMO-CXKFIQIKSA-N
Data  1 KI  1 EC50
  Tab Delimited (TSV)   2D SDfile   Computed 3D by Vconf -m prep SDfile
Find this compound or compounds like it in BindingDB:
Activity Spreadsheet -- Enzyme Inhibition Constant Data from BindingDB
Found 2 hits for monomerid = 50473477
TargetNociceptin receptor(MOUSE)
University Of Ferrara
Curated by ChEMBL
LigandPNGBDBM50473477(CHEMBL427791)
Affinity DataKi:  0.603nM. Assay description: Inhibition of [3H]NC-NH2 binding to mouse forebrain membranes
Ligand InfoPC cidPC sid
In DepthDetails ArticlePubMed
TargetNociceptin receptor(Homo sapiens (Human))
University Of Ferrara
Curated by ChEMBL
LigandPNGBDBM50473477(CHEMBL427791)
Affinity DataEC50:  0.302nM. Assay description: Inhibition of forskolin stimulated cAMP accumulation in CHO cells stably expressing the human OP4 receptor
Ligand InfoPC cidPC sid
In DepthDetails ArticlePubMed